{"text_format":"3","workbook":"xlsx","n_sheets":7,"sheets":["(はじめにお読み下さい)申請書の使い方","申請書","申請額一覧","別添","個票1","職員表","計算用"],"not_rendered":{"macros":1,"defined_names":7,"comments":5},"read":"whole","date_system":"1900"}

{"sheet":"(はじめにお読み下さい)申請書の使い方","index":0,"n_rows":16,"n_cols":4,"rows_kept":16,"merged":[[1,0,1,3]]}
[]
["本申請書の使い方、申請の手順"]
[]
["手順","都道府県の作業","事業者（法人本部）の作業","各事業所の作業"]
[1,"本Excelを管内の介護サービス事業者に配布"]
[{"$f":"A5+1","v":2},null,"本Excelを各事業所に配布し、以下の様式への記入を依頼\n・様式２（個票）\n・様式３（職員表）\n※Excelファイルを開封した際は、｢コンテンツの有効化｣をクリック"]
[{"$f":"A6+1","v":3},null,null,"以下の作業を行った上で、事業者（法人本部）へ返送\n【様式２（個票）】\n・水色セル：必要情報を入力\n・緑色セル：プルダウンから選択\n【様式３（職員表）】\n・当該事業所の従事者から、慰労金代理受領委任状を受領\n・当該委任状の提出のあった職員について、様式３に取りまとめ(青色及び緑色のセルに入力)\n※様式２で事業所番号から事業区分までの項目を全て入力→様式３で全ての従事者について必要項目を入力→様式２に戻って残る項目を記入。\n※サービス種類コードはWAMNET等でご確認ください。\n※特定施設入居者生活介護の指定を受けていない老人福祉施設は、事業所番号、サービス種類コードに「Ａ」を記入してください。"]
[4,null,"各事業所の個票のシートを１つのExcelファイルに集約し、個票シート名を「個票●」（●は１からの通し番号）に修正\n（個票1、個票2…）"]
[5,null,"各事業所の様式３（職員表）を法人単位で一覧表として取りまとめ\n兼務する複数の介護サービス事業所等から重複して申請している者がいないかを確認\n※氏名（漢字、カナ）、生年月日が一致する者がいる場合、「重複申請者確認用」欄に「可」と表示されません。\n※記入欄が不足する場合は、校閲タブから「シート保護の解除」をクリック→6行目～85行目を行ごとコピーし、86行目に右クリック→「コピーしたセルの挿入」で挿入→校閲タブから「シートの保護」をクリックして「OK」をクリック。"]
[6,null,"様式２（個票）の内容が、別添（サービス別一覧）に正しく反映されていることを確認\n※別添の記入欄が不足する場合は、6行目～20行目を行ごとコピーし、21行目に右クリック→「コピーしたセルの挿入」で挿入。"]
[7,null,"様式１（申請額一覧）の「リスト作成」ボタンを押す。（事業所番号単位のリストが自動生成される）\n※この機能は100事業所分まで対応しています。"]
[8,null,"申請書に、申請者の法人名、代表者名、日付を入力\n※慰労金の申請をする場合は、右欄外のチェック欄を確認。"]
[9,null,"Excelファイル名を代表となる事業所の事業所番号に変更\n光ディスク等にExcelファイルを保存して提出する場合は、光ディスク等の盤面に所要の事項（※）を記載したラベルを貼付又はフェルトペン等で記入\n※盤面に記載する事項\n・新型コロナ支援交付金(介護分)申請書\n・代表となる事業所番号及び事業所名\n・申請年月日（申請書に記載した日付）\n・媒体枚数（　枚中　枚目）"]
[10,null,"完成したExcelファイルを都道府県（都道府県が受付・支払業務を各都道府県の国保連に委託する場合は、各都道府県の国保連）に送付\n郵送で提出する場合には、封筒に「新型コロナ支援交付金(介護分)申請書在中」と明記\n※他の書類（介護給付費等に関する費用等の請求等）を同封しないこと。"]
[11,"事業者からExcelファイルを受領し、内容を審査\n※都道府県が受付・支払業務を各都道府県の国保連に委託する場合は、国保連を通じて都道府県に送付"]
[12,"都道府県等内で必要な作業を行い、事業者に助成金を交付\n※支払業務を国保連に委託する場合は、様式１（申請額一覧）の「審査結果」欄に「可」を入力の上、国保連に送付（月末までに送付があったものについて、翌月末に支払い）\nなお、国保連による支払確定後、国保連から事業所（事業所台帳に登録された住所宛て）に対し、支払通知書を送付"]

{"sheet":"申請書","index":1,"n_rows":43,"n_cols":62,"rows_kept":43,"merged":[[2,29,2,30],[2,32,2,33],[2,35,2,36],[4,0,4,6],[6,22,6,36],[7,22,7,36],[9,0,9,38],[13,1,13,9],[13,10,13,17],[16,2,16,22],[16,23,16,27],[17,2,17,22],[17,23,17,27],[17,47,17,48],[17,53,17,54],[17,59,17,60],[18,2,18,22],[18,23,18,27],[18,47,18,48],[18,53,18,54],[18,59,18,60],[19,2,19,22],[19,23,19,27],[37,20,38,27],[37,29,37,32],[38,28,38,36],[39,20,39,26],[39,28,39,36],[40,20,40,26],[40,28,40,36],[41,20,42,22],[41,24,41,27],[41,28,41,36],[42,24,42,27],[42,28,42,36]]}
["別記"]
["第１号様式"]
[{"$nulls":28},"　　令和",null,null,"年",null,null,"月",null,null,"日"]
[]
["岐阜県知事",{"$nulls":7},"殿"]
[]
[{"$nulls":22},"（法人名）"]
[{"$nulls":22},"（役職・代表者名）"]
[]
["令和２年度新型コロナウイルス感染症緊急包括支援交付金（介護分）に係る交付申請書"]
[]
["　標記について、次により交付金を交付されるよう関係書類を添えて申請する。"]
[]
[null,"　　申　請　額　：　",{"$nulls":8},{"$f":"SUM(申請額一覧!M5:M105)","v":0},{"$nulls":7},"千円",{"$nulls":22},{"$f":"IF(K14=SUM(別添!$N$5:$N$29),\"○\",\"! 別添(事業所一覧)の合計額と一致しません\")","v":"○"}]
[]
[null,"（内訳）",{"$nulls":39},{"$f":"IF(BH18=BH19,\"○\",\"! 職員表の合計人数と個票の合計人数が一致しません\")","v":"○"}]
[null,null,"1．介護慰労金事業",{"$nulls":20},{"$f":"SUM(申請額一覧!$H$5:$H$105)","v":0},{"$nulls":4},"千円"]
[null,null,"2．感染症対策を徹底した上での介護サービス提供支援事業",{"$nulls":20},{"$f":"SUM(申請額一覧!$J$5:$J$105)","v":0},{"$nulls":4},"千円",{"$nulls":12},"職員表計",null,null,"20万円",null,null,{"$f":"COUNTIFS(職員表!O6:O86,20)","v":0},null,"人","5万円",null,null,{"$f":"COUNTIFS(職員表!O6:O86,5)","v":0},null,"人","合計",null,null,{"$f":"SUM(AV18,BB18)","v":0},null,"人"]
[null,null,"3．在宅サービス事業所による利用者への再開支援への助成事業",{"$nulls":20},{"$f":"SUM(申請額一覧!$K$5:$K$105)","v":0},{"$nulls":4},"千円",{"$nulls":12},"個表計",null,null,"20万円",null,null,{"$f":"SUM(別添!AM5:AM30)","v":0},null,"人","5万円",null,null,{"$f":"SUM(別添!AN5:AN30)","v":0},null,"人","合計",null,null,{"$f":"SUM(AV19,BB19)","v":0},null,"人"]
[null,null,"4．在宅サービス事業所における環境整備への助成事業",{"$nulls":20},{"$f":"SUM(申請額一覧!$L$5:$L$105)","v":0},{"$nulls":4},"千円"]
{"$rows_left_out":16}
{"sheet":"申請額一覧","index":2,"n_rows":104,"n_cols":14,"rows_kept":104,"merged":[[1,0,1,6],[2,0,3,0],[2,1,3,1],[2,2,3,2],[2,3,3,3],[2,4,3,4],[2,5,3,5],[2,6,3,6],[2,7,2,12],[2,13,3,13]]}
["（様式１）事業所・施設別申請額一覧"]
["※このシートには直接入力しないでください。「別添」以降のシート記入後、右側の「リスト作成」ボタンを押下して入力してください。"]
["No.","介護保険\n事業所番号","事業所・施設名","電話番号","郵便番号","住所","代表となる\n事業所・施設名","補助予定額（千円）",{"$nulls":5},"審査\n結果"]
[{"$nulls":7},"介護\n慰労金","20万円\n対象者の\n有無","感染対策\n費用助成\n事業","個別再開\n支援助成\n事業","再開環境\n整備助成\n事業","合計"]
[{"$f":"ROW()-4","v":1},0,{"$f":"IFERROR(VLOOKUP($B5,別添!$B$5:$G$29,2,FALSE),\"\")","v":0},{"$f":"IFERROR(VLOOKUP($B5,別添!$B$5:$G$29,4,FALSE),\"\")","v":0},{"$f":"IFERROR(VLOOKUP($B5,別添!$B$5:$G$29,5,FALSE),\"\")","v":0},{"$f":"IFERROR(VLOOKUP($B5,別添!$B$5:$G$29,6,FALSE),\"\")","v":""},{"$f":"IF(M5>0,申請書!$W$7,\"\")","v":""},{"$f":"SUMIFS(別添!I$5:I$29,別添!$B$5:$B$29,$B5)","v":0},{"$f":"IFERROR(IF(COUNTIFS(別添!$B$5:$B$29,B5,別添!$J$5:$J$29,\"有\")>0,\"有\",\"\"),\"\")","v":""},{"$f":"SUMIFS(別添!K$5:K$29,別添!$B$5:$B$29,$B5)","v":0},{"$f":"SUMIFS(別添!L$5:L$29,別添!$B$5:$B$29,$B5)","v":0},{"$f":"SUMIFS(別添!M$5:M$29,別添!$B$5:$B$29,$B5)","v":0},{"$f":"SUM(H5,J5,K5,L5)","v":0}]
[{"$f":"ROW()-4","v":2},null,{"$f":"IFERROR(VLOOKUP($B6,別添!$B$5:$G$29,2,FALSE),\"\")","v":0},{"$f":"IFERROR(VLOOKUP($B6,別添!$B$5:$G$29,4,FALSE),\"\")","v":0},{"$f":"IFERROR(VLOOKUP($B6,別添!$B$5:$G$29,5,FALSE),\"\")","v":0},{"$f":"IFERROR(VLOOKUP($B6,別添!$B$5:$G$29,6,FALSE),\"\")","v":""},{"$f":"IF(M6>0,申請書!$W$7,\"\")","v":""},{"$f":"SUMIFS(別添!I$5:I$29,別添!$B$5:$B$29,$B6)","v":0},{"$f":"IFERROR(IF(COUNTIFS(別添!$B$5:$B$29,B6,別添!$J$5:$J$29,\"有\")>0,\"有\",\"\"),\"\")","v":""},{"$f":"SUMIFS(別添!K$5:K$29,別添!$B$5:$B$29,$B6)","v":0},{"$f":"SUMIFS(別添!L$5:L$29,別添!$B$5:$B$29,$B6)","v":0},{"$f":"SUMIFS(別添!M$5:M$29,別添!$B$5:$B$29,$B6)","v":0},{"$f":"SUM(H6,J6,K6,L6)","v":0}]
[3,null,{"$f":"IFERROR(VLOOKUP($B7,別添!$B$5:$G$29,2,FALSE),\"\")","v":0},{"$f":"IFERROR(VLOOKUP($B7,別添!$B$5:$G$29,4,FALSE),\"\")","v":0},{"$f":"IFERROR(VLOOKUP($B7,別添!$B$5:$G$29,5,FALSE),\"\")","v":0},{"$f":"IFERROR(VLOOKUP($B7,別添!$B$5:$G$29,6,FALSE),\"\")","v":""},{"$f":"IF(M7>0,申請書!$W$7,\"\")","v":""},{"$f":"SUMIFS(別添!I$5:I$29,別添!$B$5:$B$29,$B7)","v":0},{"$f":"IFERROR(IF(COUNTIFS(別添!$B$5:$B$29,B7,別添!$J$5:$J$29,\"有\")>0,\"有\",\"\"),\"\")","v":""},{"$f":"SUMIFS(別添!K$5:K$29,別添!$B$5:$B$29,$B7)","v":0},{"$f":"SUMIFS(別添!L$5:L$29,別添!$B$5:$B$29,$B7)","v":0},{"$f":"SUMIFS(別添!M$5:M$29,別添!$B$5:$B$29,$B7)","v":0},0]
[4,null,{"$f":"IFERROR(VLOOKUP($B8,別添!$B$5:$G$29,2,FALSE),\"\")","v":0},{"$f":"IFERROR(VLOOKUP($B8,別添!$B$5:$G$29,4,FALSE),\"\")","v":0},{"$f":"IFERROR(VLOOKUP($B8,別添!$B$5:$G$29,5,FALSE),\"\")","v":0},{"$f":"IFERROR(VLOOKUP($B8,別添!$B$5:$G$29,6,FALSE),\"\")","v":""},{"$f":"IF(M8>0,申請書!$W$7,\"\")","v":""},{"$f":"SUMIFS(別添!I$5:I$29,別添!$B$5:$B$29,$B8)","v":0},{"$f":"IFERROR(IF(COUNTIFS(別添!$B$5:$B$29,B8,別添!$J$5:$J$29,\"有\")>0,\"有\",\"\"),\"\")","v":""},{"$f":"SUMIFS(別添!K$5:K$29,別添!$B$5:$B$29,$B8)","v":0},{"$f":"SUMIFS(別添!L$5:L$29,別添!$B$5:$B$29,$B8)","v":0},{"$f":"SUMIFS(別添!M$5:M$29,別添!$B$5:$B$29,$B8)","v":0},0]
[5,null,{"$f":"IFERROR(VLOOKUP($B9,別添!$B$5:$G$29,2,FALSE),\"\")","v":0},{"$f":"IFERROR(VLOOKUP($B9,別添!$B$5:$G$29,4,FALSE),\"\")","v":0},{"$f":"IFERROR(VLOOKUP($B9,別添!$B$5:$G$29,5,FALSE),\"\")","v":0},{"$f":"IFERROR(VLOOKUP($B9,別添!$B$5:$G$29,6,FALSE),\"\")","v":""},{"$f":"IF(M9>0,申請書!$W$7,\"\")","v":""},{"$f":"SUMIFS(別添!I$5:I$29,別添!$B$5:$B$29,$B9)","v":0},{"$f":"IFERROR(IF(COUNTIFS(別添!$B$5:$B$29,B9,別添!$J$5:$J$29,\"有\")>0,\"有\",\"\"),\"\")","v":""},{"$f":"SUMIFS(別添!K$5:K$29,別添!$B$5:$B$29,$B9)","v":0},{"$f":"SUMIFS(別添!L$5:L$29,別添!$B$5:$B$29,$B9)","v":0},{"$f":"SUMIFS(別添!M$5:M$29,別添!$B$5:$B$29,$B9)","v":0},0]
[6,null,{"$f":"IFERROR(VLOOKUP($B10,別添!$B$5:$G$29,2,FALSE),\"\")","v":0},{"$f":"IFERROR(VLOOKUP($B10,別添!$B$5:$G$29,4,FALSE),\"\")","v":0},{"$f":"IFERROR(VLOOKUP($B10,別添!$B$5:$G$29,5,FALSE),\"\")","v":0},{"$f":"IFERROR(VLOOKUP($B10,別添!$B$5:$G$29,6,FALSE),\"\")","v":""},{"$f":"IF(M10>0,申請書!$W$7,\"\")","v":""},{"$f":"SUMIFS(別添!I$5:I$29,別添!$B$5:$B$29,$B10)","v":0},{"$f":"IFERROR(IF(COUNTIFS(別添!$B$5:$B$29,B10,別添!$J$5:$J$29,\"有\")>0,\"有\",\"\"),\"\")","v":""},{"$f":"SUMIFS(別添!K$5:K$29,別添!$B$5:$B$29,$B10)","v":0},{"$f":"SUMIFS(別添!L$5:L$29,別添!$B$5:$B$29,$B10)","v":0},{"$f":"SUMIFS(別添!M$5:M$29,別添!$B$5:$B$29,$B10)","v":0},0]
[7,null,{"$f":"IFERROR(VLOOKUP($B11,別添!$B$5:$G$29,2,FALSE),\"\")","v":0},{"$f":"IFERROR(VLOOKUP($B11,別添!$B$5:$G$29,4,FALSE),\"\")","v":0},{"$f":"IFERROR(VLOOKUP($B11,別添!$B$5:$G$29,5,FALSE),\"\")","v":0},{"$f":"IFERROR(VLOOKUP($B11,別添!$B$5:$G$29,6,FALSE),\"\")","v":""},{"$f":"IF(M11>0,申請書!$W$7,\"\")","v":""},{"$f":"SUMIFS(別添!I$5:I$29,別添!$B$5:$B$29,$B11)","v":0},{"$f":"IFERROR(IF(COUNTIFS(別添!$B$5:$B$29,B11,別添!$J$5:$J$29,\"有\")>0,\"有\",\"\"),\"\")","v":""},{"$f":"SUMIFS(別添!K$5:K$29,別添!$B$5:$B$29,$B11)","v":0},{"$f":"SUMIFS(別添!L$5:L$29,別添!$B$5:$B$29,$B11)","v":0},{"$f":"SUMIFS(別添!M$5:M$29,別添!$B$5:$B$29,$B11)","v":0},0]
[8,null,{"$f":"IFERROR(VLOOKUP($B12,別添!$B$5:$G$29,2,FALSE),\"\")","v":0},{"$f":"IFERROR(VLOOKUP($B12,別添!$B$5:$G$29,4,FALSE),\"\")","v":0},{"$f":"IFERROR(VLOOKUP($B12,別添!$B$5:$G$29,5,FALSE),\"\")","v":0},{"$f":"IFERROR(VLOOKUP($B12,別添!$B$5:$G$29,6,FALSE),\"\")","v":""},{"$f":"IF(M12>0,申請書!$W$7,\"\")","v":""},{"$f":"SUMIFS(別添!I$5:I$29,別添!$B$5:$B$29,$B12)","v":0},{"$f":"IFERROR(IF(COUNTIFS(別添!$B$5:$B$29,B12,別添!$J$5:$J$29,\"有\")>0,\"有\",\"\"),\"\")","v":""},{"$f":"SUMIFS(別添!K$5:K$29,別添!$B$5:$B$29,$B12)","v":0},{"$f":"SUMIFS(別添!L$5:L$29,別添!$B$5:$B$29,$B12)","v":0},{"$f":"SUMIFS(別添!M$5:M$29,別添!$B$5:$B$29,$B12)","v":0},0]
[9,null,{"$f":"IFERROR(VLOOKUP($B13,別添!$B$5:$G$29,2,FALSE),\"\")","v":0},{"$f":"IFERROR(VLOOKUP($B13,別添!$B$5:$G$29,4,FALSE),\"\")","v":0},{"$f":"IFERROR(VLOOKUP($B13,別添!$B$5:$G$29,5,FALSE),\"\")","v":0},{"$f":"IFERROR(VLOOKUP($B13,別添!$B$5:$G$29,6,FALSE),\"\")","v":""},{"$f":"IF(M13>0,申請書!$W$7,\"\")","v":""},{"$f":"SUMIFS(別添!I$5:I$29,別添!$B$5:$B$29,$B13)","v":0},{"$f":"IFERROR(IF(COUNTIFS(別添!$B$5:$B$29,B13,別添!$J$5:$J$29,\"有\")>0,\"有\",\"\"),\"\")","v":""},{"$f":"SUMIFS(別添!K$5:K$29,別添!$B$5:$B$29,$B13)","v":0},{"$f":"SUMIFS(別添!L$5:L$29,別添!$B$5:$B$29,$B13)","v":0},{"$f":"SUMIFS(別添!M$5:M$29,別添!$B$5:$B$29,$B13)","v":0},0]
[10,null,{"$f":"IFERROR(VLOOKUP($B14,別添!$B$5:$G$29,2,FALSE),\"\")","v":0},{"$f":"IFERROR(VLOOKUP($B14,別添!$B$5:$G$29,4,FALSE),\"\")","v":0},{"$f":"IFERROR(VLOOKUP($B14,別添!$B$5:$G$29,5,FALSE),\"\")","v":0},{"$f":"IFERROR(VLOOKUP($B14,別添!$B$5:$G$29,6,FALSE),\"\")","v":""},{"$f":"IF(M14>0,申請書!$W$7,\"\")","v":""},{"$f":"SUMIFS(別添!I$5:I$29,別添!$B$5:$B$29,$B14)","v":0},{"$f":"IFERROR(IF(COUNTIFS(別添!$B$5:$B$29,B14,別添!$J$5:$J$29,\"有\")>0,\"有\",\"\"),\"\")","v":""},{"$f":"SUMIFS(別添!K$5:K$29,別添!$B$5:$B$29,$B14)","v":0},{"$f":"SUMIFS(別添!L$5:L$29,別添!$B$5:$B$29,$B14)","v":0},{"$f":"SUMIFS(別添!M$5:M$29,別添!$B$5:$B$29,$B14)","v":0},0]
[11,null,{"$f":"IFERROR(VLOOKUP($B15,別添!$B$5:$G$29,2,FALSE),\"\")","v":0},{"$f":"IFERROR(VLOOKUP($B15,別添!$B$5:$G$29,4,FALSE),\"\")","v":0},{"$f":"IFERROR(VLOOKUP($B15,別添!$B$5:$G$29,5,FALSE),\"\")","v":0},{"$f":"IFERROR(VLOOKUP($B15,別添!$B$5:$G$29,6,FALSE),\"\")","v":""},{"$f":"IF(M15>0,申請書!$W$7,\"\")","v":""},{"$f":"SUMIFS(別添!I$5:I$29,別添!$B$5:$B$29,$B15)","v":0},{"$f":"IFERROR(IF(COUNTIFS(別添!$B$5:$B$29,B15,別添!$J$5:$J$29,\"有\")>0,\"有\",\"\"),\"\")","v":""},{"$f":"SUMIFS(別添!K$5:K$29,別添!$B$5:$B$29,$B15)","v":0},{"$f":"SUMIFS(別添!L$5:L$29,別添!$B$5:$B$29,$B15)","v":0},{"$f":"SUMIFS(別添!M$5:M$29,別添!$B$5:$B$29,$B15)","v":0},0]
[12,null,{"$f":"IFERROR(VLOOKUP($B16,別添!$B$5:$G$29,2,FALSE),\"\")","v":0},{"$f":"IFERROR(VLOOKUP($B16,別添!$B$5:$G$29,4,FALSE),\"\")","v":0},{"$f":"IFERROR(VLOOKUP($B16,別添!$B$5:$G$29,5,FALSE),\"\")","v":0},{"$f":"IFERROR(VLOOKUP($B16,別添!$B$5:$G$29,6,FALSE),\"\")","v":""},{"$f":"IF(M16>0,申請書!$W$7,\"\")","v":""},{"$f":"SUMIFS(別添!I$5:I$29,別添!$B$5:$B$29,$B16)","v":0},{"$f":"IFERROR(IF(COUNTIFS(別添!$B$5:$B$29,B16,別添!$J$5:$J$29,\"有\")>0,\"有\",\"\"),\"\")","v":""},{"$f":"SUMIFS(別添!K$5:K$29,別添!$B$5:$B$29,$B16)","v":0},{"$f":"SUMIFS(別添!L$5:L$29,別添!$B$5:$B$29,$B16)","v":0},{"$f":"SUMIFS(別添!M$5:M$29,別添!$B$5:$B$29,$B16)","v":0},0]
[13,null,{"$f":"IFERROR(VLOOKUP($B17,別添!$B$5:$G$29,2,FALSE),\"\")","v":0},{"$f":"IFERROR(VLOOKUP($B17,別添!$B$5:$G$29,4,FALSE),\"\")","v":0},{"$f":"IFERROR(VLOOKUP($B17,別添!$B$5:$G$29,5,FALSE),\"\")","v":0},{"$f":"IFERROR(VLOOKUP($B17,別添!$B$5:$G$29,6,FALSE),\"\")","v":""},{"$f":"IF(M17>0,申請書!$W$7,\"\")","v":""},{"$f":"SUMIFS(別添!I$5:I$29,別添!$B$5:$B$29,$B17)","v":0},{"$f":"IFERROR(IF(COUNTIFS(別添!$B$5:$B$29,B17,別添!$J$5:$J$29,\"有\")>0,\"有\",\"\"),\"\")","v":""},{"$f":"SUMIFS(別添!K$5:K$29,別添!$B$5:$B$29,$B17)","v":0},{"$f":"SUMIFS(別添!L$5:L$29,別添!$B$5:$B$29,$B17)","v":0},{"$f":"SUMIFS(別添!M$5:M$29,別添!$B$5:$B$29,$B17)","v":0},0]
[14,null,{"$f":"IFERROR(VLOOKUP($B18,別添!$B$5:$G$29,2,FALSE),\"\")","v":0},{"$f":"IFERROR(VLOOKUP($B18,別添!$B$5:$G$29,4,FALSE),\"\")","v":0},{"$f":"IFERROR(VLOOKUP($B18,別添!$B$5:$G$29,5,FALSE),\"\")","v":0},{"$f":"IFERROR(VLOOKUP($B18,別添!$B$5:$G$29,6,FALSE),\"\")","v":""},{"$f":"IF(M18>0,申請書!$W$7,\"\")","v":""},{"$f":"SUMIFS(別添!I$5:I$29,別添!$B$5:$B$29,$B18)","v":0},{"$f":"IFERROR(IF(COUNTIFS(別添!$B$5:$B$29,B18,別添!$J$5:$J$29,\"有\")>0,\"有\",\"\"),\"\")","v":""},{"$f":"SUMIFS(別添!K$5:K$29,別添!$B$5:$B$29,$B18)","v":0},{"$f":"SUMIFS(別添!L$5:L$29,別添!$B$5:$B$29,$B18)","v":0},{"$f":"SUMIFS(別添!M$5:M$29,別添!$B$5:$B$29,$B18)","v":0},0]
[15,null,{"$f":"IFERROR(VLOOKUP($B19,別添!$B$5:$G$29,2,FALSE),\"\")","v":0},{"$f":"IFERROR(VLOOKUP($B19,別添!$B$5:$G$29,4,FALSE),\"\")","v":0},{"$f":"IFERROR(VLOOKUP($B19,別添!$B$5:$G$29,5,FALSE),\"\")","v":0},{"$f":"IFERROR(VLOOKUP($B19,別添!$B$5:$G$29,6,FALSE),\"\")","v":""},{"$f":"IF(M19>0,申請書!$W$7,\"\")","v":""},{"$f":"SUMIFS(別添!I$5:I$29,別添!$B$5:$B$29,$B19)","v":0},{"$f":"IFERROR(IF(COUNTIFS(別添!$B$5:$B$29,B19,別添!$J$5:$J$29,\"有\")>0,\"有\",\"\"),\"\")","v":""},{"$f":"SUMIFS(別添!K$5:K$29,別添!$B$5:$B$29,$B19)","v":0},{"$f":"SUMIFS(別添!L$5:L$29,別添!$B$5:$B$29,$B19)","v":0},{"$f":"SUMIFS(別添!M$5:M$29,別添!$B$5:$B$29,$B19)","v":0},0]
[16,null,{"$f":"IFERROR(VLOOKUP($B20,別添!$B$5:$G$29,2,FALSE),\"\")","v":0},{"$f":"IFERROR(VLOOKUP($B20,別添!$B$5:$G$29,4,FALSE),\"\")","v":0},{"$f":"IFERROR(VLOOKUP($B20,別添!$B$5:$G$29,5,FALSE),\"\")","v":0},{"$f":"IFERROR(VLOOKUP($B20,別添!$B$5:$G$29,6,FALSE),\"\")","v":""},{"$f":"IF(M20>0,申請書!$W$7,\"\")","v":""},{"$f":"SUMIFS(別添!I$5:I$29,別添!$B$5:$B$29,$B20)","v":0},{"$f":"IFERROR(IF(COUNTIFS(別添!$B$5:$B$29,B20,別添!$J$5:$J$29,\"有\")>0,\"有\",\"\"),\"\")","v":""},{"$f":"SUMIFS(別添!K$5:K$29,別添!$B$5:$B$29,$B20)","v":0},{"$f":"SUMIFS(別添!L$5:L$29,別添!$B$5:$B$29,$B20)","v":0},{"$f":"SUMIFS(別添!M$5:M$29,別添!$B$5:$B$29,$B20)","v":0},{"$f":"SUM(H20,J20,K20,L20)","v":0}]
{"$rows_left_out":85}
{"sheet":"別添","index":3,"n_rows":32,"n_cols":40,"rows_kept":32,"merged":[[2,0,3,0],[2,1,3,1],[2,2,3,2],[2,3,3,3],[2,4,3,4],[2,5,3,5],[2,6,3,6],[2,7,3,7],[2,8,2,13]]}
["（別添）事業所・施設別申請額一覧（サービス別一覧）"]
[]
["No.","介護保険\n事業所番号","事業所・施設名","サービス種別","電話番号","郵便番号","住所","代表となる\n事業所・施設名","補助予定額（千円）"]
[{"$nulls":8},"介護\n慰労金","20万円\n対象者の\n有無","感染対策\n費用助成\n事業","個別再開\n支援助成\n事業","再開環境\n整備助成\n事業","合計"]
[{"$f":"ROW()-4","v":1},{"$f":"IFERROR(INDIRECT(\"個票\"&$A5&\"！$h$7\"),\"\")","v":0},{"$f":"IFERROR(INDIRECT(\"個票\"&$A5&\"！$t$7\"),\"\")","v":0},{"$f":"IFERROR(INDIRECT(\"個票\"&$A5&\"！$h$10\"),\"\")","v":0},{"$f":"IFERROR(INDIRECT(\"個票\"&$A5&\"！$AC$9\"),\"\")","v":0},{"$f":"IFERROR(INDIRECT(\"個票\"&$A5&\"！$d$9\"),\"\")","v":0},{"$f":"IFERROR(INDIRECT(\"個票\"&$A5&\"！$H$9\")&INDIRECT(\"個票\"&$A5&\"！$L$9\"),\"\")","v":""},{"$f":"IF(N5>0,申請書!$W$7,\"\")","v":""},{"$f":"IFERROR(INDIRECT(\"個票\"&$A5&\"！$ai$21\"),\"\")","v":0},{"$f":"IFERROR(INDIRECT(\"個票\"&$A5&\"！$ao$22\"),\"\")","v":0},{"$f":"IFERROR(INDIRECT(\"個票\"&$A5&\"！$ai$24\"),\"\")","v":""},{"$f":"IFERROR(INDIRECT(\"個票\"&$A5&\"！$ai$39\"),\"\")","v":0},{"$f":"IFERROR(INDIRECT(\"個票\"&$A5&\"！$ai$47\"),\"\")","v":""},{"$f":"SUM(I5,K5,L5,M5)","v":0},null,null,{"$f":"IF(_xlfn.SHEETS()-6=COUNTIF(N5:N32,\">0\"),\"○\",\"！（本表の事業所数と個票の枚数が一致しません）\")","v":"！（本表の事業所数と個票の枚数が一致しません）"},{"$nulls":21},{"$f":"IFERROR(INDIRECT(\"個票\"&$A5&\"！$m$22\"),\"\")","v":0},{"$f":"IFERROR(INDIRECT(\"個票\"&$A5&\"！$v$22\"),\"\")","v":0}]
[{"$f":"ROW()-4","v":2},{"$f":"IFERROR(INDIRECT(\"個票\"&$A6&\"！$h$7\"),\"\")","v":""},"","","","","",{"$f":"IF(N6>0,申請書!$W$7,\"\")","v":""},"","","","",{"$f":"IFERROR(INDIRECT(\"個票\"&$A6&\"！$ai$47\"),\"\")","v":""},0,{"$nulls":24},{"$f":"IFERROR(INDIRECT(\"個票\"&$A6&\"！$m$22\"),\"\")","v":""},{"$f":"IFERROR(INDIRECT(\"個票\"&$A6&\"！$v$22\"),\"\")","v":""}]
[3,"","","","","","",{"$f":"IF(N7>0,申請書!$W$7,\"\")","v":""},"","","","",{"$f":"IFERROR(INDIRECT(\"個票\"&$A7&\"！$ai$47\"),\"\")","v":""},0,{"$nulls":24},"",""]
[4,"","","","","","",{"$f":"IF(N8>0,申請書!$W$7,\"\")","v":""},"","","","","",0,{"$nulls":24},"",""]
[5,"","","","","","",{"$f":"IF(N9>0,申請書!$W$7,\"\")","v":""},"","","","","",0,{"$nulls":24},"",""]
[6,"","","","","","",{"$f":"IF(N10>0,申請書!$W$7,\"\")","v":""},"","","","","",0,{"$nulls":24},"",""]
[7,"","","","","","",{"$f":"IF(N11>0,申請書!$W$7,\"\")","v":""},"","","","","",0,{"$nulls":24},"",""]
[8,"","","","","","",{"$f":"IF(N12>0,申請書!$W$7,\"\")","v":""},"","","","","",0,{"$nulls":24},"",""]
[9,"","","","","","",{"$f":"IF(N13>0,申請書!$W$7,\"\")","v":""},"","","","","",0,{"$nulls":24},"",""]
[10,"","","","","","",{"$f":"IF(N14>0,申請書!$W$7,\"\")","v":""},"","","","","",0,{"$nulls":24},"",""]
[11,"","","","","","",{"$f":"IF(N15>0,申請書!$W$7,\"\")","v":""},"","","","","",0,{"$nulls":24},"",""]
[12,"","","","","","",{"$f":"IF(N16>0,申請書!$W$7,\"\")","v":""},"","","","","",0,{"$nulls":24},"",""]
[13,"","","","","","",{"$f":"IF(N17>0,申請書!$W$7,\"\")","v":""},"","","","","",0,{"$nulls":24},"",""]
[14,"","","","","","",{"$f":"IF(N18>0,申請書!$W$7,\"\")","v":""},"","","","","",0,{"$nulls":24},"",""]
[15,"","","","","","",{"$f":"IF(N19>0,申請書!$W$7,\"\")","v":""},"","","","","",0,{"$nulls":24},"",""]
[16,"","","","","","",{"$f":"IF(N20>0,申請書!$W$7,\"\")","v":""},"","","","","",0,{"$nulls":24},"",""]
{"$rows_left_out":13}
{"sheet":"個票1","index":4,"n_rows":62,"n_cols":84,"rows_kept":62,"merged":[[2,0,2,38],[4,0,4,38],[6,0,6,6],[6,7,6,13],[6,14,6,18],[6,19,6,38],[7,0,8,2],[7,3,7,6],[7,7,7,10],[7,11,7,24],[7,25,8,27],[7,28,7,32],[7,33,7,38],[8,3,8,6],[8,7,8,10],[8,11,8,24],[8,28,8,32],[8,33,8,38],[9,0,9,6],[9,7,9,16],[9,17,9,22],[9,23,9,24],[9,25,9,27],[9,28,9,29],[9,30,9,31],[9,32,9,34],[9,35,9,36],[9,37,9,38],[9,41,9,46],[10,0,11,7],[13,0,13,38],[15,23,15,25],[15,26,15,38],[16,23,16,25],[16,26,16,38],[18,0,18,38],[20,30,20,33],[20,34,20,36],[20,37,20,38],[21,7,21,11],[21,12,21,14],[21,16,21,20],[21,21,21,23],[21,30,21,32],[23,23,23,27],[23,28,25,28],[23,34,23,36],[23,37,23,38],[24,23,25,25],[24,26,25,27],[24,34,24,36],[24,37,24,38],[25,34,25,36],[25,37,25,38],[26,0,26,6],[26,7,26,11],[26,12,26,38],[27,7,27,11],[27,12,27,38],[28,7,28,11],[28,12,28,38],[29,7,29,11],[29,12,29,38],[30,7,30,11],[30,12,30,38],[31,7,31,11],[31,12,31,38],[32,7,32,11],[32,12,32,38],[33,7,33,11],[33,12,33,38],[34,7,34,11],[34,12,34,38],[35,7,35,11],[35,12,35,38],[36,7,36,11],[36,12,36,38],[38,30,38,33],[38,34,38,36],[38,37,38,38],[39,0,40,9],[39,23,39,25],[39,26,39,27],[39,28,39,33],[39,34,39,36],[39,37,39,38],[40,23,40,25],[40,26,40,27],[40,28,40,33],[40,34,40,36],[40,37,40,38],[41,1,44,9],[41,23,41,25],[41,26,41,27],[41,28,41,33],[41,34,41,36],[41,37,41,38],[42,23,42,25],[42,26,42,27],[42,28,42,33],[42,34,42,36],[42,37,42,38],[43,23,43,25],[43,26,43,27],[43,28,43,33],[43,34,43,36],[43,37,43,38],[44,23,44,25],[44,26,44,27],[44,28,44,33],[44,34,44,36],[44,37,44,38],[46,23,46,27],[46,28,48,28],[46,34,46,36],[46,37,46,38],[47,23,48,25],[47,26,48,27],[47,34,47,36],[47,37,47,38],[48,34,48,36],[48,37,48,38],[49,0,49,6],[49,7,49,11],[49,12,49,38],[50,7,50,11],[50,12,50,38],[51,7,51,11],[51,12,51,38],[52,7,52,11],[52,12,52,38],[53,7,53,11],[53,12,53,38],[54,7,54,11],[54,12,54,38],[55,7,55,11],[55,12,55,38],[56,7,56,11],[56,12,56,38],[57,7,57,11],[57,12,57,38],[58,7,58,11],[58,12,58,38],[59,7,59,11],[59,12,59,38]]}
["（様式２）"]
[]
["新型コロナウイルス感染症緊急包括支援交付金（介護分）に関する事業実施計画書（事業所単位）",{"$nulls":78},"（１）①　",null,null,"（２）②"]
[{"$nulls":79},"共通",null,"単価","共通"]
["施設概要",{"$nulls":77},"通所介護事業所（通常規模型）",892,"/事業所",null,200,"/事業所"]
[{"$nulls":78},"通所介護事業所（大規模型（Ⅰ））",{"v":1137,"d":"1,137"},"/事業所",null,200,"/事業所"]
["介護保険事業所番号",{"$nulls":13},"事業所名称",{"$nulls":63},"通所介護事業所（大規模型（Ⅱ））",{"v":1480,"d":"1,480"},"/事業所",null,200,"/事業所"]
["所在地",null,null,"郵便番号",{"$nulls":3},"都道府県名",{"$nulls":3},"住所",{"$nulls":13},"連絡先",null,null,"電話番号",{"$nulls":4},"担当部署名",{"$nulls":44},"地域密着型通所介護事業所(療養通所介護事業所を含む)",384,"/事業所",null,200,"/事業所"]
[{"$nulls":78},"認知症対応型通所介護事業所",375,"/事業所",null,200,"/事業所"]
["提供サービス",{"$nulls":16},"サービス種類コード",{"$nulls":7},"定員",{"$nulls":4},"人",null,"職員数\n(派遣含む)",{"$nulls":4},"人",{"$nulls":40},"通所リハビリテーション事業所（通常規模型）",939,"/事業所",null,200,"/事業所"]
["事業区分",{"$nulls":8}," 介護慰労金事業　→　1を記載",{"$nulls":15},"  感染対策費用助成事業　→ 2を記載",{"$nulls":52},"通所リハビリテーション事業所（大規模型（Ⅰ））",{"v":1181,"d":"1,181"},"/事業所",null,200,"/事業所"]
[{"$nulls":9}," 個別再開支援助成事業　→ 3を記載",{"$nulls":15},"　再開環境整備助成事業　→ 4を記載",{"$nulls":52},"通所リハビリテーション事業所（大規模型（Ⅱ））",{"v":1885,"d":"1,885"},"/事業所",null,200,"/事業所"]
[{"$nulls":78},"短期入所生活介護事業所",{"$f":"CD13*個票1!$AC$10","v":0},"/定員",44,200,"/事業所"]
["口座情報",{"$nulls":77},"短期入所療養介護事業所",{"$f":"CD14*個票1!$AC$10","v":0},"/定員",44,200,"/事業所"]
[{"$nulls":78},"訪問介護事業所",534,"/事業所",null,200,"/事業所"]
["国保連合会に登録されている口座情報を本事業の振込に使用することに同意する",{"$nulls":25},"本事業は原則、国保連合会のシステムを活用した補助金の交付を予定しています。（債権譲渡がある場合等を除く）",{"$nulls":51},"訪問入浴介護事業所",564,"/事業所",null,200,"/事業所"]
["国保連合会に登録されている口座は債権譲渡されていない",{"$nulls":25},"債権譲渡されていない場合は、左欄に○を入れて下さい。\n※債権譲渡されている場合、都道府県に申請して下さい。",{"$nulls":51},"訪問看護事業所",518,"/事業所",null,200,"/事業所"]
[{"$nulls":78},"訪問リハビリテーション事業所",227,"/事業所",null,200,"/事業所"]
["支出予定額",{"$nulls":77},"定期巡回・随時対応型訪問介護看護事業所",508,"/事業所",null,200,"/事業所"]
[{"$nulls":78},"夜間対応型訪問介護事業所",204,"/事業所",null,200,"/事業所"]
{"$rows_left_out":43}
{"sheet":"職員表","index":5,"n_rows":85,"n_cols":27,"rows_kept":85,"merged":[[3,0,4,0],[3,1,4,1],[3,2,4,2],[3,3,4,3],[3,6,4,6],[3,7,3,9],[3,10,3,13],[3,14,4,14],[3,15,3,18],[3,19,3,20]]}
["（様式３）介護慰労金受給職員表（法人単位）"]
[]
["※　本表は法人単位でまとめて記載すること。"]
[null,"氏名\n（漢字）","氏名\n（全角カナ）","生年月日\n（西暦）",null,null,"本人の住所","主たる勤務先",null,null,"分類",{"$nulls":3},"慰労金\n(万円)","確認事項",{"$nulls":3},"支払実績"]
[{"$nulls":4},"（確認用）","（確認用）",null,"事業所番号","サービス種類コード","事業所・施設の名称","施設区分","対応区分","(計算用)","他の施設等との期間通算がある場合その施設名",null,"委任状の有無","他法人での慰労金の申請の有無","業務委託による\n従事者","重複\n申請者確認用","支払年月日\n(西暦)","支払金額\n（円）"]
[{"$f":"ROW()-5","v":1},{"$nulls":3},{"$f":"B6&C6&D6","v":""},{"$f":"IF(E6=\"\",\"\",COUNTIF($E$6:$E$85,E6))","v":""},{"$nulls":6},{"$f":"K6&L6","v":""},null,{"$f":"IFERROR(VLOOKUP(M6,計算用!$A$8:$B$15,2,FALSE),\"\")","v":""},{"$nulls":3},{"$f":"IF(F6>=2,\"\",\"可\")","v":""}]
[{"$f":"ROW()-5","v":2},{"$nulls":3},{"$f":"B7&C7&D7","v":""},{"$f":"IF(E7=\"\",\"\",COUNTIF($E$6:$E$85,E7))","v":""},{"$nulls":6},{"$f":"K7&L7","v":""},null,{"$f":"IFERROR(VLOOKUP(M7,計算用!$A$8:$B$15,2,FALSE),\"\")","v":""},{"$nulls":3},{"$f":"IF(F7>=2,\"\",\"可\")","v":""}]
[3,{"$nulls":3},{"$f":"B8&C8&D8","v":""},{"$f":"IF(E8=\"\",\"\",COUNTIF($E$6:$E$85,E8))","v":""},{"$nulls":6},"",null,{"$f":"IFERROR(VLOOKUP(M8,計算用!$A$8:$B$15,2,FALSE),\"\")","v":""},{"$nulls":3},""]
[4,{"$nulls":3},"",{"$f":"IF(E9=\"\",\"\",COUNTIF($E$6:$E$85,E9))","v":""},{"$nulls":6},"",null,{"$f":"IFERROR(VLOOKUP(M9,計算用!$A$8:$B$15,2,FALSE),\"\")","v":""},{"$nulls":3},""]
[5,{"$nulls":3},"","",{"$nulls":6},"",null,{"$f":"IFERROR(VLOOKUP(M10,計算用!$A$8:$B$15,2,FALSE),\"\")","v":""},{"$nulls":3},""]
[6,{"$nulls":3},"","",{"$nulls":6},"",null,{"$f":"IFERROR(VLOOKUP(M11,計算用!$A$8:$B$15,2,FALSE),\"\")","v":""},{"$nulls":3},""]
[7,{"$nulls":3},"","",{"$nulls":6},"",null,{"$f":"IFERROR(VLOOKUP(M12,計算用!$A$8:$B$15,2,FALSE),\"\")","v":""},{"$nulls":3},""]
[8,{"$nulls":3},"","",{"$nulls":6},"",null,{"$f":"IFERROR(VLOOKUP(M13,計算用!$A$8:$B$15,2,FALSE),\"\")","v":""},{"$nulls":3},""]
[9,{"$nulls":3},"","",{"$nulls":6},{"$f":"K14&L14","v":""},null,{"$f":"IFERROR(VLOOKUP(M14,計算用!$A$8:$B$15,2,FALSE),\"\")","v":""},{"$nulls":3},""]
[10,{"$nulls":3},"","",{"$nulls":6},"",null,{"$f":"IFERROR(VLOOKUP(M15,計算用!$A$8:$B$15,2,FALSE),\"\")","v":""},{"$nulls":3},""]
[11,{"$nulls":3},"","",{"$nulls":6},"",null,{"$f":"IFERROR(VLOOKUP(M16,計算用!$A$8:$B$15,2,FALSE),\"\")","v":""},{"$nulls":3},""]
[12,{"$nulls":3},"","",{"$nulls":6},"",null,{"$f":"IFERROR(VLOOKUP(M17,計算用!$A$8:$B$15,2,FALSE),\"\")","v":""},{"$nulls":3},""]
[13,{"$nulls":3},"","",{"$nulls":6},"",null,{"$f":"IFERROR(VLOOKUP(M18,計算用!$A$8:$B$15,2,FALSE),\"\")","v":""},{"$nulls":3},""]
[14,{"$nulls":3},"","",{"$nulls":6},"",null,{"$f":"IFERROR(VLOOKUP(M19,計算用!$A$8:$B$15,2,FALSE),\"\")","v":""},{"$nulls":3},""]
[15,{"$nulls":3},"","",{"$nulls":6},"",null,{"$f":"IFERROR(VLOOKUP(M20,計算用!$A$8:$B$15,2,FALSE),\"\")","v":""},{"$nulls":3},""]
{"$rows_left_out":66}
{"sheet":"計算用","index":6,"n_rows":67,"n_cols":8,"rows_kept":67,"hidden":true}
[{"$nulls":7},"※本シートは絶対に編集しないこと。"]
["施設区分"]
["陽性者(濃厚接触者)発生施設","通所系･施設系で1日以上勤務又は訪問系で陽性者等に1日以上対応","訪問系で陽性者等への対応はないが対象期間に10日以上勤務","対象期間の勤務が９日以下"]
["その他の施設","対象期間に10日以上勤務","対象期間の勤務が9日以下"]
[]
[]
["慰労金単価"]
[{"$f":"A3&B3","v":"陽性者(濃厚接触者)発生施設通所系･施設系で1日以上勤務又は訪問系で陽性者等に1日以上対応"},20]
[{"$f":"A3&C3","v":"陽性者(濃厚接触者)発生施設訪問系で陽性者等への対応はないが対象期間に10日以上勤務"},5]
[{"$f":"A3&D3","v":"陽性者(濃厚接触者)発生施設対象期間の勤務が９日以下"},0]
[{"$f":"A4&B4","v":"その他の施設対象期間に10日以上勤務"},5]
[{"$f":"A4&C4","v":"その他の施設対象期間の勤務が9日以下"},0]
[]
[]
[]
[]
["なし"]
["あり"]
[]
[]
{"$rows_left_out":47}